Skip to content

improvement(knowledge): resolve connector and member state once per search #32315

improvement(knowledge): resolve connector and member state once per search

improvement(knowledge): resolve connector and member state once per search #32315

Triggered via pull request September 20, 2026 12:42
Status Failure
Total duration 3m 43s
Artifacts

ci.yml

on: pull_request
Detect Version
Detect Version
Detect Desktop Changes
Detect Desktop Changes
Prepare Trigger.dev
Prepare Trigger.dev
Matrix: Build AMD64
Matrix: Build Dev ECR
Matrix: Build ARM64 (GHCR Only)
Matrix: Test and Build / oauth-postgres
Matrix: Test and Build / test-shard
Test and Build  /  Lint and Test
2m 24s
Test and Build / Lint and Test
Test and Build  /  Build App
2m 42s
Test and Build / Build App
Check Docs Changes
Check Docs Changes
Migrate Dev DB  /  Apply Database Migrations
Migrate Dev DB / Apply Database Migrations
Check Desktop Signing Secrets
Check Desktop Signing Secrets
Migrate DB  /  Apply Database Migrations
Migrate DB / Apply Database Migrations
Create Desktop Prerelease
Create Desktop Prerelease
Promote Images
0s
Promote Images
Desktop Prerelease Build  /  Build, Sign, Notarize
Desktop Prerelease Build / Build, Sign, Notarize
Matrix: Create GHCR Manifests
Process Docs  /  Process Documentation Embeddings
Process Docs / Process Documentation Embeddings
Promote Trigger.dev
Promote Trigger.dev
Publish Desktop Prerelease
0s
Publish Desktop Prerelease
Resolve Attestation Subjects
Resolve Attestation Subjects
Prune Desktop Prereleases
0s
Prune Desktop Prereleases
Matrix: Attest Images
Create GitHub Release
0s
Create GitHub Release
Desktop Release  /  Build, Sign, Notarize
Desktop Release / Build, Sign, Notarize
Fit to window
Zoom out
Zoom in

Annotations

7 errors and 6 warnings
Test and Build / Lint and Test
Process completed with exit code 1.
Test and Build / PostgreSQL integration (migrate)
Process completed with exit code 1.
lib/knowledge/__integration__/kb-block-search.integration.ts > API-key KB block fan-out > completes 18 concurrent KB searches with access checks intact (tag filter: true): apps/sim/lib/knowledge/__integration__/kb-block-search.integration.ts#L138
AssertionError: expected [ …(90) ] to have a length of 108 but got 90 - Expected + Received - 108 + 90 ❯ lib/knowledge/__integration__/kb-block-search.integration.ts:138:47
lib/knowledge/__integration__/kb-block-search.integration.ts > API-key KB block fan-out > completes 18 concurrent KB searches with access checks intact (tag filter: false): apps/sim/lib/knowledge/__integration__/kb-block-search.integration.ts#L138
AssertionError: expected [ …(90) ] to have a length of 108 but got 90 - Expected + Received - 108 + 90 ❯ lib/knowledge/__integration__/kb-block-search.integration.ts:138:47
Test and Build / PostgreSQL integration (push)
Process completed with exit code 1.
lib/knowledge/__integration__/kb-block-search.integration.ts > API-key KB block fan-out > completes 18 concurrent KB searches with access checks intact (tag filter: true): apps/sim/lib/knowledge/__integration__/kb-block-search.integration.ts#L138
AssertionError: expected [ …(90) ] to have a length of 108 but got 90 - Expected + Received - 108 + 90 ❯ lib/knowledge/__integration__/kb-block-search.integration.ts:138:47
lib/knowledge/__integration__/kb-block-search.integration.ts > API-key KB block fan-out > completes 18 concurrent KB searches with access checks intact (tag filter: false): apps/sim/lib/knowledge/__integration__/kb-block-search.integration.ts#L138
AssertionError: expected [ …(90) ] to have a length of 108 but got 90 - Expected + Received - 108 + 90 ❯ lib/knowledge/__integration__/kb-block-search.integration.ts:138:47
Test and Build / PostgreSQL integration (migrate)
Skipping sticky disk commit due to previous step failures
Test and Build / PostgreSQL integration (migrate)
- Step: unknown (failed)
Test and Build / PostgreSQL integration (migrate)
Found 2 failed/cancelled steps in previous workflow steps
Test and Build / PostgreSQL integration (push)
Skipping sticky disk commit due to previous step failures
Test and Build / PostgreSQL integration (push)
- Step: unknown (failed)
Test and Build / PostgreSQL integration (push)
Found 2 failed/cancelled steps in previous workflow steps